IEA Wind Task 32 Wind Lidar Ontology
type: ConceptScheme

Outliers
type: Concept
broader: Pre-processed data
definition: Observaciones que se encuentran a distancias anómalas de otros valores en una muestra aleatoria de una población. Estas observaciones se consideran inválidas y son descartadas. @es
definition: 在人口的随机抽样中，与其他数值存在异常距离的观测值。这些观测值被认为是无效的。 @cn
definition: Observations that lie abnormal distances from other values in a random sample from a population. These observations are regarded as invalid.
definition: In un gruppo di misurazioni, singole misure dalle caratteristiche particolarmente differenti rispetto alle statistiche principali del gruppo stesso. @it
in scheme: IEA Wind Task 32 Wind Lidar Ontology
preferred label: Ausreißer @de
preferred label: 异常值 @cn
preferred label: Anomalie @it

Pre-processed data
type: Concept
narrower: Outliers
preferred label: Vorverarbeitete Daten @de
preferred label: 预处理的数据 @cn
preferred label: Dati pre-processati @it