IEA Wind Task 32 Wind Lidar Ontology
type: ConceptScheme

Optical amplifier
type: Concept
narrower: Optical amplifier bandwidth
preferred label: Optischer Verstärker @de
preferred label: 光放大器 @cn
preferred label: Amplificador óptico @es
preferred label: Amplificatore ottico @it

Optical amplifier bandwidth
type: Concept
broader: Optical amplifier
definition: Banda di frequenza attiva nell'amplificatore ottico. @it
definition: 光放大器的工作带宽 @cn
definition: Working bandwith of the optical amplifier.
definition: Ancho de banda de la frecuencia de trabajo del amplificador óptico. @es
in scheme: IEA Wind Task 32 Wind Lidar Ontology
preferred label: Bandbreite des optischen Verstärkers @de
preferred label: 光放大器带宽 @cn
preferred label: Larghezza d'onda dell'amplificatore ottico @it