IEA Wind Task 32 Wind Lidar Ontology
type: ConceptScheme

Measurement volume
type: Concept
broader: Scan geometry
definition: 测风激光雷达采集信号的空间范围。具体来说，由光束预设的扫描位置所围成的空间，激光雷达将在这个空间内进行测量。 @cn
definition: Región caracterizada por el lidar de viento. Corresponde a la región en la que los diferentes rayos con diversas orientaciones (o líneas de visión, LOS por sus siglas en inglés) penetran en la atmósfera tomando datos a lo largo de un volumen de muestreo. A lo largo de estos volúmenes de muestreo, cada uno correspondiente a una orientación (o línea de visión) el sistema adquiere datos intermedios de los que se extraen las mediciones finales. @es
definition: Lo spazio illuminato dai fasci laser del lidar. Corresponde all'unione di tutte le regioni investigata dai singoli fasci laser (e loro singole aree di misurazione - probe volumes) che possono costituire un sistema lidar da cui le misurazioni grezze sono prese e combinate per costruire la misurazione finale. @it
definition: The region characterised by the wind lidar. Corresponds to the region penetrated by the various beam orientations / lines of sight and probe volumes where intermediate data are acquired to produce a final measurement.
in scheme: IEA Wind Task 32 Wind Lidar Ontology
preferred label: Messvolumen @de
preferred label: 测量范围 @cn
preferred label: Volumen de medición @es
preferred label: Volume di misurazione @it

Scan geometry
type: Concept
narrower: Measurement volume
preferred label: Scan-Geometrie @de
preferred label: 扫描路径 @cn
preferred label: 扫描的几何路径 @cn
preferred label: Geometria di scansionamento @it
preferred label: Geometría de escaneo @es
preferred label: Geometria di scansione @it