IEA Wind Task 32 Wind Lidar Ontology
type: ConceptScheme

设备
type: Concept
narrower: Leice
preferred label: Dispositivi lidar @it
preferred label: Dispositivos @es
preferred label: Geräte @de
preferred label: Devices @en

Leice
type: Concept
broader: 设备
definition: Familia de lidares de viento producidos por Leice. Véase: http://www.leice-lidar.com/en/index.html @es
definition: Leice公司生产的风向激光雷达系列。请参考http://www.leice-lidar.com/en/index.html。
definition: Family of wind lidars produced by Leice. Please refer to http://www.leice-lidar.com/en/index.html. @en
definition: Famiglia di lidars prodotti da Leice. Per maggiori informazioni, visitare http://www.leice-lidar.com/en/index.html. @it
in scheme: IEA Wind Task 32 Wind Lidar Ontology
narrower: WindMast
narrower: WindHorizon
narrower: Wind3D
preferred label: Lidar 'Leice' @de

Wind3D
type: Concept
broader: Leice
preferred label: Lidar 'Wind3D' @it

WindHorizon
type: Concept
broader: Leice
preferred label: Lidar 'WindHorizon' @it

WindMast
type: Concept
broader: Leice
preferred label: Lidar 'WindMast' @it