IEA Wind Task 32 Wind Lidar Ontology
type: ConceptScheme

Laser frequency
type: Concept
broader: Laser mode
definition: Frecuencia de la luz de la fuente láser. @es
definition: 激光源的光频率。 @cn
definition: Light frequency of the laser source.
definition: Frequenza della luce della sorgente laser. @it
in scheme: IEA Wind Task 32 Wind Lidar Ontology
preferred label: Laserfrequenz @de
preferred label: 激光频率 @cn
preferred label: Frequenza del laser @it

Laser mode
type: Concept
narrower: Laser frequency
preferred label: Laser-Modus @de
preferred label: 激光模式 @cn
preferred label: Modo del laser @it