IEA Wind Task 32 Wind Lidar Ontology
type: ConceptScheme

Data communication
type: Concept
narrower: File granulity
preferred label: Datenübertragung @de
preferred label: 数据通信 @cn
preferred label: Comunicazione dati @it

File granulity
type: Concept
units: samples
broader: Data communication
definition: Die Größe der von Dateien abgedeckten Zeitintervalle der Messung, z.B. 10-min oder 1-h Dateien. @de
definition: 以时间或采样单位来表示的文件大小，例如，10分钟文件或1小时文件 @cn
definition: Intervallo temporale coperto da dei dati contenuti in un file dati. @it
definition: The size of the file in terms of time period or samples e.g. 10-min files or 1 hour files.
definition: El tamaño del archivo en términos de período de tiempo o muestras, por ejemplo, archivos de 10 minutos o archivos de 1 hora. @es
in scheme: IEA Wind Task 32 Wind Lidar Ontology
preferred label: Granularität der Datei @de
preferred label: 文件颗粒度 @cn
preferred label: Granularita' del file @it