IEA Wind Task 32 Wind Lidar Ontology
type: ConceptScheme

设备
type: Concept
narrower: Epsiline
preferred label: Dispositivi lidar @it
preferred label: Dispositivos @es
preferred label: Geräte @de
preferred label: Devices @en

Epsiline
type: Concept
broader: 设备
definition: Familia de lidares de viento producidos por Epsiline. Véase: http://www.epsiline.com/ @es
definition: Epsiline公司生产的风雷达系列。请参考http://www.epsiline.com/。
definition: Family of wind lidars produced by Epsiline. Please refer to http://www.epsiline.com/. @en
definition: Famiglia di lidars prodotti da Epsiline. Per maggiori informazioni, visitare http://www.epsiline.com/. @it
in scheme: IEA Wind Task 32 Wind Lidar Ontology
narrower: Wind Eagle
preferred label: Lidar 'Epsiline' @de

Wind Eagle
type: Concept
broader: Epsiline
preferred label: Lidar 'Wind Eagle' @de