IEA Wind Task 32 Wind Lidar Ontology
type: ConceptScheme

Datum feature
type: Concept
alternative label: Reference marker
broader: Measurement height
definition: A distinguishing feature used to recognise or define the datum plane from which the measurement height is defined.
definition: 用于识别或定义测量高度的基准平面的主要特征(值) @cn
definition: Característica específica utilizada para distinguir o definit el plano de referencia desde el que se define la medida de altura. @es
definition: Un elemento ben distinguibile atto a riconoscere o definire un piano di riferimento per la definizione dell'altezza di misurazione. @it
in scheme: IEA Wind Task 32 Wind Lidar Ontology
preferred label: 基准特征 @cn
preferred label: Característica de referencia @es
preferred label: Elemento di riferimento @it

Measurement height
type: Concept
narrower: Datum feature
preferred label: Messhöhe @de
preferred label: 测量高度 @cn
preferred label: Altura de medición @es
preferred label: Altezza di misurazione @it