IEA Wind Task 32 Wind Lidar Ontology
type: ConceptScheme

Coherent
type: Concept
broader: Detection type
definition: 一种激光雷达系统，其中频率偏移是通过比较返回信号和参考信号来测量的。 @cn
definition: Sistema lidar donde el cambio de frecuencia se mide comparando la señal de retorno con una señal de referencia. @es
definition: Un sistema lidar in cui lo spostamento di frequenza viene misurato confrontando il segnale di ritorno con un segnale di riferimento. @it
definition: Ein Lidar-System, bei dem die Frequenzverschiebung gemessen wird, indem das Rücksignal mit einem Referenzsignal verglichen wird. @de
definition: A lidar system where the frequency shift is measured by comparing the return signal to a reference signal.
in scheme: IEA Wind Task 32 Wind Lidar Ontology
preferred label: Kohärent @de
preferred label: 相干 @cn
preferred label: Coerente @it

Detection type
type: Concept
narrower: Coherent
preferred label: Art der Erkennung @de
preferred label: 检测类型 @cn
preferred label: Tipo di rilevamento @it