IEA Wind Task 32 Wind Lidar Ontology
type: ConceptScheme

Azimuth angle
type: Concept
units: degrees
alternative label: Azimuth
broader: Scanner azimuth positioning servo
definition: L'angolo fra la direzione del fascio laser ed un vettore di riferimento in un piano di riferimento. @it
definition: Angulo subtendido entre la línea de visión (line-of-sight o LOS, por sus siglas en inglés) del lidar y el vector de referencia del plano de referencia. @es
definition: 激光雷达的视线与基准平面上的参考向量之间的夹角。 @cn
definition: The angle between the line of sight of the lidar and a reference vector on the reference coordinate system.
editorial note: The reference vector from which the azimuth is defined is often true north, but could be some other defined vector.
editorial note: Il vettore di riferimento dell'angolo di azimith è spesso quello che indica il nord geografico. Un qualsiasi altro vettore, in realtà, potrebbe analogamente servire allo scopo. @it
editorial note: El vector de referencia desde el que se define el ángulo azimut es a menudo el eje de coordenadas correspondiente al norte geográfico, pero cualquier otra definición es válida siempre y cuando la definición del sistema de coordenadas sea consistente. @es
in scheme: IEA Wind Task 32 Wind Lidar Ontology
preferred label: Azimut @it
preferred label: 方位角 @cn
preferred label: Azimut-Winkel @de

Scanner azimuth positioning servo
type: Concept
narrower: Azimuth angle
preferred label: Azimut-Positionierservo des Scanners @de
preferred label: 扫描器方位定位伺服 @cn
preferred label: Servomotor de posicionamiento azimut del escáner @es
preferred label: Servomotore per la scansione nella direzione azimutale @it