NEAT
type: ConceptScheme

Hub
contributor: https://orcid.org/0000-0002-9381-9693
creator: http://orcid.org/0000-0003-4124-9073
broader: Rotor
in scheme: NEAT
definition: A fixture for attaching the blades or blade assembly to the rotor shaft.
type: Concept

Rotor
type: Concept
narrower: Hub