IEV ref
definition: A code used to identify certain concept in IEC Electropedia (http://www.electropedia.org/)

NEAT
type: ConceptScheme

Cooling
IEV ref: 411-44
contributor: https://orcid.org/0000-0002-9381-9693
creator: http://orcid.org/0000-0003-4124-9065
broader: Nacelle
in scheme: NEAT
definition: A procedure by means of which heat resulting from losses occurring in a machine is given up to a primary coolant which may be continuously replaced or may itself be cooled by a secondary coolant in a heat exchanger.
type: Concept

Nacelle
type: Concept
narrower: Cooling