NEAT
type: ConceptScheme

Turbine Control
type: Concept
contributor: https://orcid.org/0000-0002-9381-9693
creator: http://orcid.org/0000-0003-4124-9070
broader: Nacelle
in scheme: NEAT
definition: A wind turbine sub‑system that receives information about the condition of the wind turbine and/or its environment and adjusts the turbine in order to operate it within its operating limits.

Nacelle
type: Concept
narrower: Turbine Control