NEAT
type: ConceptScheme

Aerial
type: Concept
contributor: https://orcid.org/0000-0002-9381-9693
creator: http://orcid.org/0000-0003-4124-9058
alternative label: Airborne
broader: Concept Design
in scheme: NEAT
definition: An aerial wind turbine is a design concept for a wind turbine with a rotor supported in the air without a tower, thus benefiting from more mechanical and aerodynamic options, the higher velocity and persistence of wind at high altitudes.

Concept Design
type: Concept
narrower: Aerial