NEAT
type: ConceptScheme

Siting
type: Concept
narrower: Wind Mapping

Wind Mapping
type: Concept
contributor: https://orcid.org/0000-0002-9381-9693
creator: http://orcid.org/0000-0003-4124-9052
broader: Siting
definition: A process of visualizing spatial variation of wind speed over geographic areas to help choosing prospective development areas for wind turbines installation.
in scheme: NEAT