NEAT
type: ConceptScheme

Concept Design
type: Concept
narrower: Mono-Multi Rotor

Mono-Multi Rotor
type: Concept
contributor: https://orcid.org/0000-0002-9381-9693
creator: http://orcid.org/0000-0003-4124-9060
broader: Concept Design
definition: A wind turbine with one or more rotors, independent on the number of blades.
in scheme: NEAT