NEAT
type: ConceptScheme

Lattice
type: Concept
contributor: https://orcid.org/0000-0002-9381-9693
creator: http://orcid.org/0000-0003-4124-9081
broader: Tower
definition: A structure consisting of strips of wood or metal crossed and fastened together with square-shaped spaces left between, used as a support for climbing plants.
in scheme: NEAT

Tower
type: Concept
narrower: Lattice