NEAT
type: ConceptScheme

Generator
type: Concept
contributor: https://orcid.org/0000-0002-9381-9693
creator: http://orcid.org/0000-0003-4124-9067
broader: Nacelle
definition: A machine which converts mechanical energy into electrical energy.
in scheme: NEAT

Nacelle
type: Concept
narrower: Generator