iec-61400-23-name
definition: IEC 61400-23 standardized name of a parameter

dnvgl-st-0376-name
definition: DNVGL-ST-0376 standardized name of a parameter

ASPECT
type: Concept
type: ConceptScheme

reference_number_cycles
long-name: Reference Number Cycles
iec-61400-23-name: nt1
dnvgl-st-0376-name: Nref
creator: https://orcid.org/0000-0002-4573-1232
broader: Wind Turbine Blade Terms
in scheme: ASPECT
definition: Reference number of cycles for damage-equivalent load determination
type: Concept

Wind Turbine Blade Terms
type: Concept
narrower: reference_number_cycles