dnvgl-st-0376-name
definition: DNVGL-ST-0376 standardized name of a parameter

ASPECT
type: Concept
type: ConceptScheme

partial_fatigue_verification_factor
long-name: Partial Fatigue Verification Factor
dnvgl-st-0376-name: gamma_mfatigue
creator: https://orcid.org/0000-0002-4573-1232
broader: Wind Turbine Blade Terms
in scheme: ASPECT
definition: Partial reduction factor gm for fatigue verification
type: Concept

Wind Turbine Blade Terms
type: Concept
narrower: partial_fatigue_verification_factor