iec-61400-23-name
definition: IEC 61400-23 standardized name of a parameter

ASPECT
type: Concept
type: ConceptScheme

partial_environmental_factor_fatigue
long-name: Partial Environmental Factor Fatigue
iec-61400-23-name: gamma_lf
creator: https://orcid.org/0000-0002-4573-1232
broader: Wind Turbine Blade Terms
in scheme: ASPECT
definition: Partial factors for environmental effects during fatigue tests
type: Concept

Wind Turbine Blade Terms
type: Concept
narrower: partial_environmental_factor_fatigue