prefered unit
definition: A prefered unit for a given parameter

iec-61400-23-name
definition: IEC 61400-23 standardized name of a parameter

ASPECT
type: Concept
type: ConceptScheme

load_range_calculated
long-name: Load Range Calculated
altf unit: lbf ft
prefered unit: N m
iec-61400-23-name: W0, load_width_calculated
creator: https://orcid.org/0000-0002-4573-1232
broader: Wind Turbine Blade Terms
in scheme: ASPECT
definition: Calculated load range within a cycle loading block
type: Concept

Wind Turbine Blade Terms
type: Concept
narrower: load_range_calculated