iec-61400-23-name
definition: IEC 61400-23 standardized name of a parameter

ASPECT
type: Concept
type: ConceptScheme

dynamic_strength_one_cycle
long-name: Dynamic Strength One Cycle
iec-61400-23-name: D
creator: https://orcid.org/0000-0002-4573-1232
broader: Wind Turbine Blade Terms
in scheme: ASPECT
definition: Dynamic strength valid for one load cycle
type: Concept

Wind Turbine Blade Terms
type: Concept
narrower: dynamic_strength_one_cycle