prefered unit
definition: A prefered unit for a given parameter

dnvgl-st-0376-name
definition: DNVGL-ST-0376 standardized name of a parameter

ASPECT
type: Concept
type: ConceptScheme

characteristic_value_material_property_strain
long-name: Characteristic Value Material Property Strain
altf unit: mm mm-1, in in-1
prefered unit: mepsilon
dnvgl-st-0376-name: Rk
creator: https://orcid.org/0000-0002-4573-1232
broader: Wind Turbine Blade Terms
in scheme: ASPECT
definition: Strain related characteristic value of a material property
type: Concept

Wind Turbine Blade Terms
type: Concept
narrower: characteristic_value_material_property_strain