prefered unit
definition: A prefered unit for a given parameter

iec-61400-25-2-name
definition: IEC 61400-25-2 standardized name of a parameter

abbrevation
definition: A shortened form of a parameter label used as a short name of parameter in different applications.

ASPECT
type: Concept
type: ConceptScheme

yaw_angle
type: Concept
long-name: Yaw Angle
prefered unit: def
iec-61400-25-2-name: YwAng
abbrevation: yaw
creator: https://orcid.org/0000-0002-9381-9693
broader: Wind Turbine Nacelle Terms
in scheme: ASPECT
definition: An angle of a wind turbine yaw bearing relative to the nominal true North

Wind Turbine Nacelle Terms
type: Concept
narrower: yaw_angle