prefered unit
definition: A prefered unit for a given parameter

abbrevation
definition: A shortened form of a parameter label used as a short name of parameter in different applications.

ASPECT
type: Concept
type: ConceptScheme

wind_speed
type: Concept
long-name: Wind Speed
prefered unit: m s-1
abbrevation: WS
creator: https://orcid.org/0000-0002-9381-9693
alternative label: horizontal_wind_speed
alternative label: Vh
broader: Enviromental Condition Terms
in scheme: ASPECT
definition: Speed is the magnitude of velocity. Wind is defined as a two-dimensional (horizontal) air velocity vector, with no vertical component. (Vertical motion in the atmosphere has the standard name upward_air_velocity.) The wind speed is the magnitude of the wind velocity.

Enviromental Condition Terms
type: Concept
narrower: wind_speed