prefered unit
definition: A prefered unit for a given parameter

iec-61400-23-name
definition: IEC 61400-23 standardized name of a parameter

ASPECT
type: Concept
type: ConceptScheme

torsion_moment
type: Concept
long-name: Torsion Moment
altf unit: lbf ft
prefered unit: N m
iec-61400-23-name: Mc
creator: https://orcid.org/0000-0002-4573-1232
alternative label: blade_torsion_moment
broader: Wind Turbine Blade Terms
in scheme: ASPECT
definition: Blade torsion moment (chordwise coordinate system)

Wind Turbine Blade Terms
type: Concept
narrower: torsion_moment