prefered unit
definition: A prefered unit for a given parameter

iec-61400-23-name
definition: IEC 61400-23 standardized name of a parameter

ASPECT
type: Concept
type: ConceptScheme

spanwise_force
type: Concept
long-name: Spanwise Force
altf unit: lbf
prefered unit: N
iec-61400-23-name: Fz
creator: https://orcid.org/0000-0002-4573-1232
broader: Wind Turbine Blade Terms
in scheme: ASPECT
definition: Spanwise (tensile) force (rotor coordinate system)

Wind Turbine Blade Terms
type: Concept
narrower: spanwise_force