dnvgl-st-0376-name
definition: DNVGL-ST-0376 standardized name of a parameter

ASPECT
type: Concept
type: ConceptScheme

permissible_number_cycles_bin
type: Concept
long-name: Permissible Number Cycles Bin
dnvgl-st-0376-name: Ni
creator: https://orcid.org/0000-0002-4573-1232
broader: Wind Turbine Blade Terms
in scheme: ASPECT
definition: Permissible number of cycles for the load amplitude SkA and mean SkM in bin i.

Wind Turbine Blade Terms
type: Concept
narrower: permissible_number_cycles_bin