dnvgl-st-0376-name
definition: DNVGL-ST-0376 standardized name of a parameter

ASPECT
type: Concept
type: ConceptScheme

partial_temperature_effects_factor
type: Concept
long-name: Partial Temperature Effects Factor
dnvgl-st-0376-name: gamma_m2
creator: https://orcid.org/0000-0002-4573-1232
broader: Wind Turbine Blade Terms
in scheme: ASPECT
definition: Partial reduction factor for temperature effects (reversible effects)

Wind Turbine Blade Terms
type: Concept
narrower: partial_temperature_effects_factor