dnvgl-st-0376-name
definition: DNVGL-ST-0376 standardized name of a parameter

ASPECT
type: Concept
type: ConceptScheme

number_cycles_bin
type: Concept
long-name: Number Cycles Bin
dnvgl-st-0376-name: ni
creator: https://orcid.org/0000-0002-4573-1232
broader: Wind Turbine Blade Terms
in scheme: ASPECT
definition: Number of load cycles in fatigue load bin i

Wind Turbine Blade Terms
type: Concept
narrower: number_cycles_bin