prefered unit
definition: A prefered unit for a given parameter

iec-61400-13-name
definition: IEC 61400-13 standardized name of a parameter

iec-61400-23-name
definition: IEC 61400-23 standardized name of a parameter

ASPECT
type: Concept
type: ConceptScheme

flapwise_bending_moment
type: Concept
long-name: Flapwise Bending Moment
altf unit: lbf ft
prefered unit: N m
iec-61400-13-name: Mbf
iec-61400-23-name: My
creator: https://orcid.org/0000-0002-4573-1232
broader: Wind Turbine Blade Terms
in scheme: ASPECT
definition: Flapwise bending moment (rotor coordinate system)

Wind Turbine Blade Terms
type: Concept
narrower: flapwise_bending_moment