ASPECT
type: Concept
type: ConceptScheme

Wind Turbine Blade Terms
type: Concept
narrower: torsion_moment

iec-61400-23-name
definition: IEC 61400-23 standardized name of a parameter

prefered unit
definition: A prefered unit for a given parameter

torsion_moment
type: Concept
altf unit: lbf ft
iec-61400-23-name: Mc
long-name: Torsion Moment
prefered unit: N m
creator: https://orcid.org/0000-0002-4573-1232
alternative label: blade_torsion_moment
broader: Wind Turbine Blade Terms
definition: Blade torsion moment (chordwise coordinate system)
in scheme: ASPECT