ASPECT
type: Concept
type: ConceptScheme

Wind Turbine Blade Terms
type: Concept
narrower: pitch_angle

abbrevation
definition: A shortened form of a parameter label used as a short name of parameter in different applications.

iec-61400-25-2-name
definition: IEC 61400-25-2 standardized name of a parameter

pitch_angle
type: Concept
abbrevation: pitch
iec-61400-25-2-name: BlPthAngVal
long-name: Pitch Angle
prefered unit: deg
creator: https://orcid.org/0000-0002-9381-9693
broader: Wind Turbine Blade Terms
definition: An angle of a single wind turbine blade or all bladed comprising wind turbine rotor in a moving air. In IEC 61400-25-2 this correspongs to the parameter BlPthAngVal (Pitch angle for blade as feedback from the pitch system).
in scheme: ASPECT

prefered unit
definition: A prefered unit for a given parameter