ASPECT
type: Concept
type: ConceptScheme

Wind Turbine Blade Terms
type: Concept
narrower: partial_manufacturing_effects_factor

dnvgl-st-0376-name
definition: DNVGL-ST-0376 standardized name of a parameter

partial_manufacturing_effects_factor
type: Concept
dnvgl-st-0376-name: gamma_m3
long-name: Partial Manufacturing Effects Factor
creator: https://orcid.org/0000-0002-4573-1232
broader: Wind Turbine Blade Terms
definition: Partial reduction factor for manufacturing effects
in scheme: ASPECT