ASPECT
type: Concept
type: ConceptScheme

Wind Turbine Blade Terms
type: Concept
narrower: number_specimens

dnvgl-st-0376-name
definition: DNVGL-ST-0376 standardized name of a parameter

number_specimens
type: Concept
dnvgl-st-0376-name: n
long-name: Number Specimens
creator: https://orcid.org/0000-0002-4573-1232
broader: Wind Turbine Blade Terms
definition: Number of specimen test results in the sample
in scheme: ASPECT