ASPECT
type: Concept
type: ConceptScheme

Wind Turbine Blade Terms
type: Concept
narrower: flapwise_shear_force

flapwise_shear_force
type: Concept
altf unit: lbf
iec-61400-23-name: Fx
long-name: Flapwise Shear Force
prefered unit: N
creator: https://orcid.org/0000-0002-4573-1232
broader: Wind Turbine Blade Terms
definition: Flapwise shear force (rotor coordinate system)
in scheme: ASPECT

iec-61400-23-name
definition: IEC 61400-23 standardized name of a parameter

prefered unit
definition: A prefered unit for a given parameter