ASPECT
type: Concept
type: ConceptScheme

Wind Turbine Blade Terms
type: Concept
narrower: design_load_fatigue

design_load_fatigue
type: Concept
altf unit: lbf ft
dnvgl-st-0376-name: Fequivalent
iec-61400-23-name: Fdf
long-name: Design Load Fatigue
prefered unit: N m
creator: https://orcid.org/0000-0002-4573-1232
alternative label: equivalent_design_load
broader: Wind Turbine Blade Terms
definition: Equivalent load whose associated fatigue damage is equal to the fatigue damage calculated from the design load spectrum; the equivalent load is dependent on the number of test load cycles.
in scheme: ASPECT

dnvgl-st-0376-name
definition: DNVGL-ST-0376 standardized name of a parameter

iec-61400-23-name
definition: IEC 61400-23 standardized name of a parameter

prefered unit
definition: A prefered unit for a given parameter